BDBM86879 CAS_22422464::N-(2-chlorobenzyl)-5-(3,5-dimethylpiperidin-1-ylsulfonyl)-3-methylbenzofuran-2-carboxamide::NSC_22422464
SMILES CC1CC(C)CN(C1)S(=O)(=O)c1ccc2oc(C(=O)NCc3ccccc3Cl)c(C)c2c1
InChI Key InChIKey=PUDRHBJLNGSDRO-UHFFFAOYSA-N
Data  2 KI
  Tab Delimited (TSV)   2D SDfile   Computed 3D by Vconf -m prep SDfile
Find this compound or compounds like it in BindingDB:
Activity Spreadsheet -- Enzyme Inhibition Constant Data from BindingDB
Found 2 hits for monomerid = 86879
TargetCannabinoid receptor 1(Homo sapiens (Human))
Vernalis (R&D)
Curated by PDSP Ki Database
LigandPNGBDBM86879(CAS_22422464 | N-(2-chlorobenzyl)-5-(3,5-dimethylp...)
Affinity DataKi:  58nM
In DepthDetails ArticlePubMed
TargetCannabinoid receptor 2(Homo sapiens (Human))
Vernalis (R&D)
Curated by PDSP Ki Database
LigandPNGBDBM86879(CAS_22422464 | N-(2-chlorobenzyl)-5-(3,5-dimethylp...)
Affinity DataKi:  4.80E+3nM
In DepthDetails ArticlePubMed