BDBM86882 CAS_4055807::N-benzyl-5-(3,5-dimethylpiperidin-1-ylsulfonyl)-N-ethyl-3-methylbenzofuran-2-carboxamide::NSC_4055807
SMILES CCN(Cc1ccccc1)C(=O)c1oc2ccc(cc2c1C)S(=O)(=O)N1CC(C)CC(C)C1
InChI Key InChIKey=ZNHNBEXEBBBFMB-UHFFFAOYSA-N
Data  2 KI
  Tab Delimited (TSV)   2D SDfile   Computed 3D by Vconf -m prep SDfile
Find this compound or compounds like it in BindingDB:
Activity Spreadsheet -- Enzyme Inhibition Constant Data from BindingDB
Found 2 hits for monomerid = 86882
TargetCannabinoid receptor 1(Homo sapiens (Human))
Vernalis (R&D)
Curated by PDSP Ki Database
LigandPNGBDBM86882(CAS_4055807 | N-benzyl-5-(3,5-dimethylpiperidin-1-...)
Affinity DataKi:  92nM
In DepthDetails ArticlePubMed
TargetCannabinoid receptor 2(Homo sapiens (Human))
Vernalis (R&D)
Curated by PDSP Ki Database
LigandPNGBDBM86882(CAS_4055807 | N-benzyl-5-(3,5-dimethylpiperidin-1-...)
Affinity DataKi:  3.10E+3nM
In DepthDetails ArticlePubMed