BDBM87005 (6-(methylsulfonyl)-1-pentyl-1H-indol-3-yl)(naphthalen-2-yl)methanone::CAS_44450450::NSC_44450450
SMILES CCCCCn1cc(C(=O)c2ccc3ccccc3c2)c2ccc(cc12)S(C)(=O)=O
InChI Key InChIKey=XGCMCUGMWBSZNX-UHFFFAOYSA-N
Data  1 KI
  Tab Delimited (TSV)   2D SDfile   Computed 3D by Vconf -m prep SDfile
Find this compound or compounds like it in BindingDB:
Activity Spreadsheet -- Enzyme Inhibition Constant Data from BindingDB
Found 1 hit for monomerid = 87005
TargetCannabinoid receptor 1(Homo sapiens (Human))
F. Hoffmann-La Roche
Curated by PDSP Ki Database
LigandPNGBDBM87005((6-(methylsulfonyl)-1-pentyl-1H-indol-3-yl)(naphth...)
Affinity DataKi:  110nM
Ligand InfoPC cidPC sid
In DepthDetails ArticlePubMed