BDBM87064 Sulfonamide derivative, 5
SMILES CC(CCC(=O)Nc1nnc(s1)S(N)(=O)=O)C1CCC2C3C(CC4CC(CCC4(C)C3CC(OC(C)=O)C12C)OC(C)=O)OC(C)=O
InChI Key InChIKey=MJLLURNREQGHPE-UHFFFAOYSA-N
Data  1 KI  1 IC50
  Tab Delimited (TSV)   2D SDfile   Computed 3D by Vconf -m prep SDfile
Find this compound or compounds like it in BindingDB:
Activity Spreadsheet -- Enzyme Inhibition Constant Data from BindingDB
Found 1 hit for monomerid = 87064
Target6-phosphogluconate dehydrogenase, decarboxylating(Homo sapiens (Human))
Dumlupinar University
LigandPNGBDBM87064(Sulfonamide derivative, 5)
Affinity DataKi:  4.20E+3nM IC50:  2.53E+3nM. Assay description: The enzyme activities in the absence of drugs or chemicals were taken as 100%. For each drug or chemical, an activity%-(drug) graph was drawn and dr...
In DepthDetails ArticlePubMed