BDBM87091 2-(2-imidazo[1,2-a]pyridinylmethylthio)-1H-imidazo[4,5-b]pyridine::2-(imidazo[1,2-a]pyridin-2-ylmethylsulfanyl)-1H-imidazo[4,5-b]pyridine::2-(imidazo[1,2-a]pyridin-2-ylmethylthio)-1H-imidazo[4,5-b]pyridine::MLS-0463473.0001::cid_20908496
SMILES C(Sc1nc2ncccc2[nH]1)c1cn2ccccc2n1
InChI Key InChIKey=ASXHPQUTMKGKKU-UHFFFAOYSA-N
Data  1 IC50
  Tab Delimited (TSV)   2D SDfile   Computed 3D by Vconf -m prep SDfile
Find this compound or compounds like it in BindingDB:
Activity Spreadsheet -- Enzyme Inhibition Constant Data from BindingDB
Found 1 hit for monomerid = 87091
TargetDNA dC->dU-editing enzyme APOBEC-3G(Homo sapiens (Human))
Burnham Center For Chemical Genomics
Curated by PubChem BioAssay
LigandPNGBDBM87091(2-(2-imidazo[1,2-a]pyridinylmethylthio)-1H-imidazo...)
Affinity DataIC50: >9.90E+4nMT: 2°C. Assay description: Data Source: Sanford-Burnham Center for Chemical Genomics (SBCCG) Source Affiliation: Sanford-Burnham Medical Research Institute (SBMRI, San Diego, C...
In DepthDetails PCBioAssay