BDBM87128 N-[(1S)-2-[4-(5-iodo-2-keto-3H-benzimidazol-1-yl)piperidino]-1-methyl-ethyl]-2-phenyl-cyclopropanecarboxamide;2,2,2-trifluoroacetic acid::N-[(2S)-1-[4-(5-iodanyl-2-oxidanylidene-3H-benzimidazol-1-yl)piperidin-1-yl]propan-2-yl]-2-phenyl-cyclopropane-1-carboxamide;2,2,2-tris(fluoranyl)ethanoic acid::N-[(2S)-1-[4-(5-iodo-2-oxo-3H-benzimidazol-1-yl)-1-piperidinyl]propan-2-yl]-2-phenyl-1-cyclopropanecarboxamide;2,2,2-trifluoroacetic acid::N-[(2S)-1-[4-(5-iodo-2-oxo-3H-benzimidazol-1-yl)piperidin-1-yl]propan-2-yl]-2-phenylcyclopropane-1-carboxamide;2,2,2-trifluoroacetic acid::VU0409796-1::cid_53469891
SMILES C[C@@H](CN1CCC(CC1)n1c2ccc(I)cc2[nH]c1=O)NC(=O)C1CC1c1ccccc1
InChI Key InChIKey=GPNSKMDEBNTBNC-ATIQYGATSA-N
Data  2 IC50
  Tab Delimited (TSV)   2D SDfile   Computed 3D by Vconf -m prep SDfile
Find this compound or compounds like it in BindingDB:
Activity Spreadsheet -- Enzyme Inhibition Constant Data from BindingDB
Found 2 hits for monomerid = 87128
TargetPhospholipase D1(Homo sapiens (Human))
Vanderbilt Specialized Chemistry Center
Curated by PubChem BioAssay
LigandPNGBDBM87128(N-[(1S)-2-[4-(5-iodo-2-keto-3H-benzimidazol-1-yl)p...)
Affinity DataIC50:  21nM. Assay description: Phospholipase D (PLD) generates the lipid second messenger phosphatidic acid as part of a plethora of cellular functions. Phosphatidic acid (PtdOH) i...
In DepthDetails PCBioAssay
TargetPhospholipase D2(Homo sapiens (Human))
Vanderbilt Specialized Chemistry Center
Curated by PubChem BioAssay
LigandPNGBDBM87128(N-[(1S)-2-[4-(5-iodo-2-keto-3H-benzimidazol-1-yl)p...)
Affinity DataIC50:  6.50E+3nM. Assay description: Phospholipase D (PLD) generates the lipid second messenger phosphatidic acid as part of a plethora of cellular functions. Phosphatidic acid (PtdOH) i...
In DepthDetails PCBioAssay