BDBM87164 CHEMBL1253820::N-[2-[1-(4-fluorophenyl)-4-keto-1,3,8-triazaspiro[4.5]decan-8-yl]ethyl]quinoline-3-carboxamide;2,2,2-trifluoroacetic acid::N-[2-[1-(4-fluorophenyl)-4-oxidanylidene-1,3,8-triazaspiro[4.5]decan-8-yl]ethyl]quinoline-3-carboxamide;2,2,2-tris(fluoranyl)ethanoic acid::N-[2-[1-(4-fluorophenyl)-4-oxo-1,3,8-triazaspiro[4.5]decan-8-yl]ethyl]-3-quinolinecarboxamide;2,2,2-trifluoroacetic acid::N-[2-[1-(4-fluorophenyl)-4-oxo-1,3,8-triazaspiro[4.5]decan-8-yl]ethyl]quinoline-3-carboxamide;2,2,2-trifluoroacetic acid::VU0402720-1::cid_53469966
SMILES Fc1ccc(cc1)N1CNC(=O)C11CCN(CCNC(=O)c2cnc3ccccc3c2)CC1
InChI Key InChIKey=CAVWYRPALCSFGD-UHFFFAOYSA-N
Data  6 IC50
  Tab Delimited (TSV)   2D SDfile   Computed 3D by Vconf -m prep SDfile
Find this compound or compounds like it in BindingDB:
Activity Spreadsheet -- Enzyme Inhibition Constant Data from BindingDB
Found 6 hits for monomerid = 87164
TargetPhospholipase D2(Homo sapiens (Human))
Vanderbilt Specialized Chemistry Center
Curated by PubChem BioAssay
LigandPNGBDBM87164(CHEMBL1253820 | N-[2-[1-(4-fluorophenyl)-4-keto-1,...)
Affinity DataIC50:  40nM. Assay description: Phospholipase D (PLD) generates the lipid second messenger phosphatidic acid as part of a plethora of cellular functions. Phosphatidic acid (PtdOH) i...
In DepthDetails PCBioAssay
TargetPhospholipase D2(Homo sapiens (Human))
Vanderbilt Specialized Chemistry Center
Curated by PubChem BioAssay
LigandPNGBDBM87164(CHEMBL1253820 | N-[2-[1-(4-fluorophenyl)-4-keto-1,...)
Affinity DataIC50:  140nM. Assay description: Phospholipase D (PLD) generates the lipid second messenger phosphatidic acid as part of a plethora of cellular functions. Phosphatidic acid (PtdOH) i...
In DepthDetails PCBioAssay
TargetPhospholipase D2(Homo sapiens (Human))
Vanderbilt Specialized Chemistry Center
Curated by PubChem BioAssay
LigandPNGBDBM87164(CHEMBL1253820 | N-[2-[1-(4-fluorophenyl)-4-keto-1,...)
Affinity DataIC50:  40nM. Assay description: Inhibition of human GST-tagged PLD2A in human HEK293 cells
In DepthDetails ArticlePubMed
TargetPhospholipase D1(Homo sapiens (Human))
Vanderbilt Specialized Chemistry Center
Curated by PubChem BioAssay
LigandPNGBDBM87164(CHEMBL1253820 | N-[2-[1-(4-fluorophenyl)-4-keto-1,...)
Affinity DataIC50:  2.00E+3nM. Assay description: Phospholipase D (PLD) generates the lipid second messenger phosphatidic acid as part of a plethora of cellular functions. Phosphatidic acid (PtdOH) i...
In DepthDetails PCBioAssay
TargetPhospholipase D1(Homo sapiens (Human))
Vanderbilt Specialized Chemistry Center
Curated by PubChem BioAssay
LigandPNGBDBM87164(CHEMBL1253820 | N-[2-[1-(4-fluorophenyl)-4-keto-1,...)
Affinity DataIC50:  2.00E+3nM. Assay description: Inhibition of PLD1 in human calu1 cells
In DepthDetails ArticlePubMed
TargetPhospholipase D1(Homo sapiens (Human))
Vanderbilt Specialized Chemistry Center
Curated by PubChem BioAssay
LigandPNGBDBM87164(CHEMBL1253820 | N-[2-[1-(4-fluorophenyl)-4-keto-1,...)
Affinity DataIC50:  2.00E+4nM. Assay description: Phospholipase D (PLD) generates the lipid second messenger phosphatidic acid as part of a plethora of cellular functions. Phosphatidic acid (PtdOH) i...
In DepthDetails PCBioAssay