BDBM8722 3-(6-Aminopyridin-3-yl)-N-methyl-N-[(1-methyl-1H-indol-2-yl)methyl]propionamide::3-(6-aminopyridin-3-yl)-N-methyl-N-[(1-methyl-1H-indol-2-yl)methyl]propanamide::aminopyridine deriv. 11
SMILES CN(Cc1cc2ccccc2n1C)C(=O)CCc1ccc(N)nc1
InChI Key InChIKey=CAEFFYSYRJMIGG-UHFFFAOYSA-N
Data  2 IC50
  Tab Delimited (TSV)   2D SDfile   Computed 3D by Vconf -m prep SDfile
Find this compound or compounds like it in BindingDB:
Activity Spreadsheet -- Enzyme Inhibition Constant Data from BindingDB
Found 2 hits for monomerid = 8722
TargetEnoyl-[acyl-carrier-protein] reductase [NADH] FabI(Haemophilus influenzae)
Glaxosmithkline
LigandPNGBDBM8722(3-(6-Aminopyridin-3-yl)-N-methyl-N-[(1-methyl-1H-i...)
Affinity DataIC50:  9.74E+4nMT: 2°C. Assay description: Assays were carried out in half-area, 96-well microtiter plates. Compounds were evaluated in assay mixtures containing components specific for each e...
Ligand InfoMMDBPC cidPC sid
In DepthDetails ArticlePubMed
TargetEnoyl-[acyl-carrier-protein] reductase [NADPH] FabI(Staphylococcus aureus)
Glaxosmithkline
LigandPNGBDBM8722(3-(6-Aminopyridin-3-yl)-N-methyl-N-[(1-methyl-1H-i...)
Affinity DataIC50:  9.37E+4nMpH: 6.5 T: 2°C. Assay description: Assays were carried out in half-area, 96-well microtiter plates. Compounds were evaluated in assay mixtures containing components specific for each e...
Ligand InfoMMDBPC cidPC sid
In DepthDetails ArticlePubMed