BDBM87332 (2E)-2-(p-tolylhydrazono)naphthalen-1-one::(2E)-2-[(4-methylphenyl)hydrazinylidene]-1-naphthalenone::(2E)-2-[(4-methylphenyl)hydrazinylidene]naphthalen-1-one::2-[(4-methylphenyl)diazenyl]-1-naphthol::MLS001180148::SMR000477775::cid_9603961
SMILES Cc1ccc(cc1)N=Nc1ccc2ccccc2c1O
InChI Key InChIKey=MKQFEBQHAPAJFM-UHFFFAOYSA-N
Data  3 IC50
  Tab Delimited (TSV)   2D SDfile   Computed 3D by Vconf -m prep SDfile
Find this compound or compounds like it in BindingDB:
Activity Spreadsheet -- Enzyme Inhibition Constant Data from BindingDB
Found 3 hits for monomerid = 87332
TargetNuclear receptor coactivator 3(Homo sapiens (Human))
The Scripps Research Institute Molecular Screening Center
Curated by PubChem BioAssay
LigandPNGBDBM87332((2E)-2-(p-tolylhydrazono)naphthalen-1-one | (2E)-2...)
Affinity DataIC50: >3.59E+4nM. Assay description: Source (MLPCN Center Name): The Scripps Research Institute Molecular Screening Center (SRIMSC) Affiliation: The Scripps Research Institute, TSRI Assa...
In DepthDetails PCBioAssay
TargetNuclear receptor coactivator 1(Homo sapiens (Human))
The Scripps Research Institute Molecular Screening Center
Curated by PubChem BioAssay
LigandPNGBDBM87332((2E)-2-(p-tolylhydrazono)naphthalen-1-one | (2E)-2...)
Affinity DataIC50: >3.59E+4nM. Assay description: Source (MLPCN Center Name): The Scripps Research Institute Molecular Screening Center (SRIMSC) Affiliation: The Scripps Research Institute, TSRI Assa...
In DepthDetails PCBioAssay
TargetTegument protein VP16(Human herpesvirus 1 (strain 17) (HHV-1) (Human her...)
The Scripps Research Institute Molecular Screening Center
Curated by PubChem BioAssay
LigandPNGBDBM87332((2E)-2-(p-tolylhydrazono)naphthalen-1-one | (2E)-2...)
Affinity DataIC50:  2.12E+4nM. Assay description: Source (MLPCN Center Name): The Scripps Research Institute Molecular Screening Center (SRIMSC) Affiliation: The Scripps Research Institute, TSRI Assa...
In DepthDetails PCBioAssay