BDBM87399 6-[5-[(1H-benzimidazol-2-ylthio)methyl]-2-keto-4-imidazolin-4-yl]-6-keto-hexanoic acid ethyl ester::6-[5-[(1H-benzimidazol-2-ylthio)methyl]-2-oxo-1,3-dihydroimidazol-4-yl]-6-oxohexanoic acid ethyl ester::MLS000087784::SMR000024004::cid_3239618::ethyl 6-[5-(1H-benzimidazol-2-ylsulfanylmethyl)-2-oxidanylidene-1,3-dihydroimidazol-4-yl]-6-oxidanylidene-hexanoate::ethyl 6-[5-(1H-benzimidazol-2-ylsulfanylmethyl)-2-oxo-1,3-dihydroimidazol-4-yl]-6-oxohexanoate::ethyl 6-{5-[(1H-benzimidazol-2-ylthio)methyl]-2-oxo-2,3-dihydro-1H-imidazol-4-yl}-6-oxohexanoate
SMILES CCOC(=O)CCCCC(=O)c1[nH]c(=O)[nH]c1CSc1nc2ccccc2[nH]1
InChI Key InChIKey=HRCGOBVLZLYNFI-UHFFFAOYSA-N
Data  1 IC50
  Tab Delimited (TSV)   2D SDfile   Computed 3D by Vconf -m prep SDfile
Find this compound or compounds like it in BindingDB:
Activity Spreadsheet -- Enzyme Inhibition Constant Data from BindingDB
Found 1 hit for monomerid = 87399
TargetTyrosine-protein kinase ABL1(Homo sapiens (Human))
The Scripps Research Institute Molecular Screening Center
Curated by PubChem BioAssay
LigandPNGBDBM87399(6-[5-[(1H-benzimidazol-2-ylthio)methyl]-2-keto-4-i...)
Affinity DataIC50:  96.7nM. Assay description: Source (MLPCN Center Name): The Scripps Research Institute Molecular Screening Center (SRIMSC) Affiliation: The Scripps Research Institute, TSRI Assa...
In DepthDetails PCBioAssay