BDBM87615 3,6-Di-pyridin-3-yl-[1,2,4,5]tetrazine::3,6-bis(3-pyridinyl)-1,2,4,5-tetrazine::3,6-bis(3-pyridyl)-1,2,4,5-tetrazine::3,6-dipyridin-3-yl-1,2,4,5-tetrazine::MLS000075752::SMR000014589::cid_656025
SMILES c1cncc(c1)-c1nnc(nn1)-c1cccnc1
InChI Key InChIKey=OLXAHCQKLVGQOG-UHFFFAOYSA-N
Data  2 IC50  1 EC50
  Tab Delimited (TSV)   2D SDfile   Computed 3D by Vconf -m prep SDfile
Find this compound or compounds like it in BindingDB:
Activity Spreadsheet -- Enzyme Inhibition Constant Data from BindingDB
Found 3 hits for monomerid = 87615
TargetPolyadenylate-binding protein 1(Homo sapiens (Human))
Burnham Center For Chemical Genomics
Curated by PubChem BioAssay
LigandPNGBDBM87615(3,6-Di-pyridin-3-yl-[1,2,4,5]tetrazine | 3,6-bis(3...)
Affinity DataIC50: >6.60E+4nM. Assay description: Data Source: Sanford-Burnham Center for Chemical Genomics (SBCCG) Source Affiliation: Sanford-Burnham Medical Research Institute (SBMRI, San Diego, C...
In DepthDetails PCBioAssay
TargetXylosyl- and glucuronyltransferase LARGE1(Homo sapiens (Human))
Burnham Center For Chemical Genomics
Curated by PubChem BioAssay
LigandPNGBDBM87615(3,6-Di-pyridin-3-yl-[1,2,4,5]tetrazine | 3,6-bis(3...)
Affinity DataEC50:  8.73E+3nM
In DepthDetails PCBioAssay
TargetPolyadenylate-binding protein 1(Homo sapiens (Human))
Burnham Center For Chemical Genomics
Curated by PubChem BioAssay
LigandPNGBDBM87615(3,6-Di-pyridin-3-yl-[1,2,4,5]tetrazine | 3,6-bis(3...)
Affinity DataIC50: >6.60E+4nM. Assay description: Data Source: Sanford-Burnham Center for Chemical Genomics (SBCCG) Source Affiliation: Sanford-Burnham Medical Research Institute (SBMRI, San Diego, C...
In DepthDetails PCBioAssay