BDBM87668 6-amino-5-cyano-2-(2-ethoxy-2-keto-ethyl)-4-(5-methyl-2-furyl)-4H-pyran-3-carboxylic acid ethyl ester::6-amino-5-cyano-2-(2-ethoxy-2-oxoethyl)-4-(5-methyl-2-furanyl)-4H-pyran-3-carboxylic acid ethyl ester::MLS000043612::SMR000020628::cid_3241774::ethyl 6-amino-5-cyano-2-(2-ethoxy-2-oxoethyl)-4-(5-methyl-2-furyl)-4H-pyran-3-carboxylate::ethyl 6-amino-5-cyano-2-(2-ethoxy-2-oxoethyl)-4-(5-methylfuran-2-yl)-4H-pyran-3-carboxylate::ethyl 6-azanyl-5-cyano-2-(2-ethoxy-2-oxidanylidene-ethyl)-4-(5-methylfuran-2-yl)-4H-pyran-3-carboxylate
SMILES CCOC(=O)CC1=C(C(C(C#N)C(=N)O1)c1ccc(C)o1)C(=O)OCC
InChI Key InChIKey=NZTYCQXQETULND-UHFFFAOYSA-N
Data  2 IC50
  Tab Delimited (TSV)   2D SDfile   Computed 3D by Vconf -m prep SDfile
Find this compound or compounds like it in BindingDB:
Activity Spreadsheet -- Enzyme Inhibition Constant Data from BindingDB
Found 2 hits for monomerid = 87668
TargetPolyadenylate-binding protein 1(Homo sapiens (Human))
Burnham Center For Chemical Genomics
Curated by PubChem BioAssay
LigandPNGBDBM87668(6-amino-5-cyano-2-(2-ethoxy-2-keto-ethyl)-4-(5-met...)
Affinity DataIC50: >6.60E+4nM. Assay description: Data Source: Sanford-Burnham Center for Chemical Genomics (SBCCG) Source Affiliation: Sanford-Burnham Medical Research Institute (SBMRI, San Diego, C...
In DepthDetails PCBioAssay
TargetPolyadenylate-binding protein 1(Homo sapiens (Human))
Burnham Center For Chemical Genomics
Curated by PubChem BioAssay
LigandPNGBDBM87668(6-amino-5-cyano-2-(2-ethoxy-2-keto-ethyl)-4-(5-met...)
Affinity DataIC50:  3.20E+4nM. Assay description: Data Source: Sanford-Burnham Center for Chemical Genomics (SBCCG) Source Affiliation: Sanford-Burnham Medical Research Institute (SBMRI, San Diego, C...
In DepthDetails PCBioAssay