BDBM87670 4-[(3,4-dimethylbenzoyl)amino]-2,3-dihydrothiophene-5-carboxylic acid methyl ester::4-[[(3,4-dimethylphenyl)-oxomethyl]amino]-2,3-dihydrothiophene-5-carboxylic acid methyl ester::MLS000087767::SMR000023987::cid_3242715::methyl 3-[(3,4-dimethylbenzoyl)amino]-4,5-dihydrothiophene-2-carboxylate::methyl 4-[(3,4-dimethylbenzoyl)amino]-2,3-dihydrothiophene-5-carboxylate::methyl 4-[(3,4-dimethylphenyl)carbonylamino]-2,3-dihydrothiophene-5-carboxylate
SMILES COC(=O)C1=C(CCS1)NC(=O)c1ccc(C)c(C)c1
InChI Key InChIKey=BTSLREWPUKGJRM-UHFFFAOYSA-N
Data  2 IC50
  Tab Delimited (TSV)   2D SDfile   Computed 3D by Vconf -m prep SDfile
Find this compound or compounds like it in BindingDB:
Activity Spreadsheet -- Enzyme Inhibition Constant Data from BindingDB
Found 2 hits for monomerid = 87670
TargetPolyadenylate-binding protein 1(Homo sapiens (Human))
Burnham Center For Chemical Genomics
Curated by PubChem BioAssay
LigandPNGBDBM87670(4-[(3,4-dimethylbenzoyl)amino]-2,3-dihydrothiophen...)
Affinity DataIC50: >6.60E+4nM. Assay description: Data Source: Sanford-Burnham Center for Chemical Genomics (SBCCG) Source Affiliation: Sanford-Burnham Medical Research Institute (SBMRI, San Diego, C...
In DepthDetails PCBioAssay
TargetPolyadenylate-binding protein 1(Homo sapiens (Human))
Burnham Center For Chemical Genomics
Curated by PubChem BioAssay
LigandPNGBDBM87670(4-[(3,4-dimethylbenzoyl)amino]-2,3-dihydrothiophen...)
Affinity DataIC50: >6.60E+4nM. Assay description: Data Source: Sanford-Burnham Center for Chemical Genomics (SBCCG) Source Affiliation: Sanford-Burnham Medical Research Institute (SBMRI, San Diego, C...
In DepthDetails PCBioAssay