BDBM87686 6-[(6-methyl-2-pyridinyl)amino]-6-(trifluoromethyl)-2,3-dihydroimidazo[2,1-b][1,3]thiazol-5(6H)-one::6-[(6-methyl-2-pyridinyl)amino]-6-(trifluoromethyl)-2,3-dihydroimidazo[2,1-b]thiazol-5-one::6-[(6-methyl-2-pyridyl)amino]-6-(trifluoromethyl)-2,3-dihydroimidazo[2,1-b]thiazol-5-one::6-[(6-methylpyridin-2-yl)amino]-6-(trifluoromethyl)-2,3-dihydroimidazo[2,1-b][1,3]thiazol-5-one::MLS000050734::SMR000078244::cid_2962125
SMILES Cc1cccc(NC2(N=C3SCCN3C2=O)C(F)(F)F)n1
InChI Key InChIKey=BRTITNXXQUYBBF-UHFFFAOYSA-N
Data  2 IC50
  Tab Delimited (TSV)   2D SDfile   Computed 3D by Vconf -m prep SDfile
Find this compound or compounds like it in BindingDB:
Activity Spreadsheet -- Enzyme Inhibition Constant Data from BindingDB
Found 2 hits for monomerid = 87686
TargetPolyadenylate-binding protein 1(Homo sapiens (Human))
Burnham Center For Chemical Genomics
Curated by PubChem BioAssay
LigandPNGBDBM87686(6-[(6-methyl-2-pyridinyl)amino]-6-(trifluoromethyl...)
Affinity DataIC50: >6.60E+4nM. Assay description: Data Source: Sanford-Burnham Center for Chemical Genomics (SBCCG) Source Affiliation: Sanford-Burnham Medical Research Institute (SBMRI, San Diego, C...
In DepthDetails PCBioAssay
TargetPolyadenylate-binding protein 1(Homo sapiens (Human))
Burnham Center For Chemical Genomics
Curated by PubChem BioAssay
LigandPNGBDBM87686(6-[(6-methyl-2-pyridinyl)amino]-6-(trifluoromethyl...)
Affinity DataIC50: >6.60E+4nM. Assay description: Data Source: Sanford-Burnham Center for Chemical Genomics (SBCCG) Source Affiliation: Sanford-Burnham Medical Research Institute (SBMRI, San Diego, C...
In DepthDetails PCBioAssay