BDBM87694 2-[(5-methyl-2-furoyl)amino]-5,6,7,8-tetrahydro-4H-cyclohepta[b]thiophene-3-carboxylic acid methyl ester::2-[[(5-methyl-2-furanyl)-oxomethyl]amino]-5,6,7,8-tetrahydro-4H-cyclohepta[b]thiophene-3-carboxylic acid methyl ester::MLS000088824::SMR000071975::cid_898280::methyl 2-[(5-methyl-2-furoyl)amino]-5,6,7,8-tetrahydro-4H-cyclohepta[b]thiophene-3-carboxylate::methyl 2-[(5-methylfuran-2-carbonyl)amino]-5,6,7,8-tetrahydro-4H-cyclohepta[b]thiophene-3-carboxylate::methyl 2-[(5-methylfuran-2-yl)carbonylamino]-5,6,7,8-tetrahydro-4H-cyclohepta[b]thiophene-3-carboxylate
SMILES COC(=O)c1c(NC(=O)c2ccc(C)o2)sc2CCCCCc12
InChI Key InChIKey=TWDGUJMSVZCBJL-UHFFFAOYSA-N
Data  2 IC50
  Tab Delimited (TSV)   2D SDfile   Computed 3D by Vconf -m prep SDfile
Find this compound or compounds like it in BindingDB:
Activity Spreadsheet -- Enzyme Inhibition Constant Data from BindingDB
Found 2 hits for monomerid = 87694
TargetPolyadenylate-binding protein 1(Homo sapiens (Human))
Burnham Center For Chemical Genomics
Curated by PubChem BioAssay
LigandPNGBDBM87694(2-[(5-methyl-2-furoyl)amino]-5,6,7,8-tetrahydro-4H...)
Affinity DataIC50: >6.60E+4nM. Assay description: Data Source: Sanford-Burnham Center for Chemical Genomics (SBCCG) Source Affiliation: Sanford-Burnham Medical Research Institute (SBMRI, San Diego, C...
In DepthDetails PCBioAssay
TargetPolyadenylate-binding protein 1(Homo sapiens (Human))
Burnham Center For Chemical Genomics
Curated by PubChem BioAssay
LigandPNGBDBM87694(2-[(5-methyl-2-furoyl)amino]-5,6,7,8-tetrahydro-4H...)
Affinity DataIC50: >6.60E+4nM. Assay description: Data Source: Sanford-Burnham Center for Chemical Genomics (SBCCG) Source Affiliation: Sanford-Burnham Medical Research Institute (SBMRI, San Diego, C...
In DepthDetails PCBioAssay