BDBM87854 MLS000583060::N-cyclohexyl-6-methyl-2-(3-pyridinyl)-3-imidazo[1,2-a]pyridinamine::N-cyclohexyl-6-methyl-2-pyridin-3-yl-imidazo[1,2-a]pyridin-3-amine::N-cyclohexyl-6-methyl-2-pyridin-3-ylimidazo[1,2-a]pyridin-3-amine::SMR000206246::cid_861681::cyclohexyl-[6-methyl-2-(3-pyridyl)imidazo[1,2-a]pyridin-3-yl]amine
SMILES Cc1ccc2nc(c(NC3CCCCC3)n2c1)-c1cccnc1
InChI Key InChIKey=MSAMYZZCDZWSEE-UHFFFAOYSA-N
Data  3 IC50
  Tab Delimited (TSV)   2D SDfile   Computed 3D by Vconf -m prep SDfile
Find this compound or compounds like it in BindingDB:
Activity Spreadsheet -- Enzyme Inhibition Constant Data from BindingDB
Found 3 hits for monomerid = 87854
TargetProtein skinhead-1(Caenorhabditis elegans)
Burnham Center For Chemical Genomics
Curated by PubChem BioAssay
LigandPNGBDBM87854(MLS000583060 | N-cyclohexyl-6-methyl-2-(3-pyridiny...)
Affinity DataIC50:  2.35E+4nM
In DepthDetails PCBioAssay
TargetTyrosyl-DNA phosphodiesterase 2(Homo sapiens (Human))
The Scripps Research Institute Molecular Screening Center
Curated by PubChem BioAssay
LigandPNGBDBM87854(MLS000583060 | N-cyclohexyl-6-methyl-2-(3-pyridiny...)
Affinity DataIC50:  1.28E+5nM. Assay description: Source (MLPCN Center Name): The Scripps Research Institute Molecular Screening Center (SRIMSC) Center Affiliation: The Scripps Research Institute (TS...
In DepthDetails PCBioAssay
TargetHeat shock protein hsp-16.2(Caenorhabditis elegans)
Burnham Center For Chemical Genomics
Curated by PubChem BioAssay
LigandPNGBDBM87854(MLS000583060 | N-cyclohexyl-6-methyl-2-(3-pyridiny...)
Affinity DataIC50:  3.62E+3nM
In DepthDetails PCBioAssay