BDBM881 L-685,434 derivative::L-689,502::N-(2(R)-Hydroxy-1(S)-indanyl)-5(S)-[(tert-butyloxycarbonyl)amino]-4(S)-hydroxy-6-phenyl-2(R)-[[4-[2-(4-morpholinyl)ethoxy]phenyl]methl]hexanamide::tert-butyl N-[(2S,3S,5R)-3-hydroxy-5-{[(1S,2R)-2-hydroxy-2,3-dihydro-1H-inden-1-yl]carbamoyl}-5-({4-[2-(morpholin-4-yl)ethoxy]phenyl}methyl)-1-phenylpentan-2-yl]carbamate
SMILES CC(C)(C)OC(=O)N[C@@H](Cc1ccccc1)[C@@H](O)C[C@@H](Cc1ccc(OCCN2CCOCC2)cc1)C(=O)N[C@@H]1[C@H](O)Cc2ccccc12
InChI Key InChIKey=IYLCQJSWFWQHCD-AIIVFDHXSA-N
Data  2 IC50
  Tab Delimited (TSV)   2D SDfile   Computed 3D by Vconf -m prep SDfile
Find this compound or compounds like it in BindingDB:
Activity Spreadsheet -- Enzyme Inhibition Constant Data from BindingDB
Found 2 hits for monomerid = 881
TargetGag-Pol polyprotein [489-587](Human immunodeficiency virus type 1)
Merck Research Laboratories
Curated by ChEMBL
LigandPNGBDBM881(L-685,434 derivative | L-689,502 | N-(2(R)-Hydroxy...)
Affinity DataIC50:  0.450nM. Assay description: Compound was evaluated in vitro for the inhibition of HIV protease, using a peptide hydrolysis assay
In DepthDetails ArticlePubMed
TargetDimer of Gag-Pol polyprotein [489-587](Human immunodeficiency virus type 1)
Merck Research Laboratories
LigandPNGBDBM881(L-685,434 derivative | L-689,502 | N-(2(R)-Hydroxy...)
Affinity DataIC50:  0.450nMpH: 5.5 T: 2°C. Assay description: Sensitivity of HIV-1 protease activity to protease inhibitors was determined by a peptide substrate cleavage assay. Protease products were analyzed o...
In DepthDetails ArticlePubMed