BDBM88215 US9695118, 575
SMILES CCS(=O)(=O)c1ccc(Cl)cc1CNC(=O)c1cc(C#N)c(CN2CCN(C)CC2)c(c1)C(F)(F)F
InChI Key InChIKey=GRCBTPQDYPABJA-UHFFFAOYSA-N
Data  1 IC50
  Tab Delimited (TSV)   2D SDfile   Computed 3D by Vconf -m prep SDfile
Find this compound or compounds like it in BindingDB:
Activity Spreadsheet -- Enzyme Inhibition Constant Data from BindingDB
Found 1 hit for monomerid = 88215
TargetEpithelial discoidin domain-containing receptor 1(Homo sapiens (Human))
Chugai Seiyaku Kabushiki Kaisha
US Patent
LigandPNGBDBM88215(US9695118, 575)
Affinity DataIC50:  16nMT: 2°C. Assay description: DDR1 binding activity was measured by the LanthaScreen (Registered trademark) Eu Kinase Binding Assay (manufactured by Life Technologies Corporation)...
In DepthDetails US Patent