BDBM8823 3-(4-{4-amino-6-methylthieno[2,3-d]pyrimidin-5-yl}phenyl)-1-(cyclohexylmethyl)urea::N-[4-(4-Amino-6-methylthieno[2,3-d]pyrimidin-5-yl)-phenyl]-N -cyclohexylmethylurea::Thienopyrimidine deriv. 32
SMILES Cc1sc2ncnc(N)c2c1-c1ccc(NC(=O)NCC2CCCCC2)cc1
InChI Key InChIKey=YTOMBAGWKAJACA-UHFFFAOYSA-N
Data  2 IC50
  Tab Delimited (TSV)   2D SDfile   Computed 3D by Vconf -m prep SDfile
Find this compound or compounds like it in BindingDB:
Activity Spreadsheet -- Enzyme Inhibition Constant Data from BindingDB
Found 2 hits for monomerid = 8823
TargetVascular endothelial growth factor receptor 2(Homo sapiens (Human))
Dalian University
Curated by ChEMBL
LigandPNGBDBM8823(3-(4-{4-amino-6-methylthieno[2,3-d]pyrimidin-5-yl}...)
Affinity DataIC50:  794nM. Assay description: Inhibition of KDR
In DepthDetails ArticlePubMed
TargetVascular endothelial growth factor receptor 2(Homo sapiens (Human))
Dalian University
Curated by ChEMBL
LigandPNGBDBM8823(3-(4-{4-amino-6-methylthieno[2,3-d]pyrimidin-5-yl}...)
Affinity DataIC50:  790nM. Assay description: The assay uses purified enzyme interacting with biotinylated peptide substrate. HTRF is based on the proximity of europium cryptate (donor fluorophor...
In DepthDetails ArticlePubMed