BDBM8827 1-(4-{4-aminothieno[2,3-d]pyrimidin-5-yl}phenyl)-3-butylurea::N-[4-(4-Aminothieno[2,3-d]pyrimidin-5-yl)phenyl]-N -butylurea::Thienopyrimidine deriv. 77
SMILES CCCCNC(=O)Nc1ccc(cc1)-c1csc2ncnc(N)c12
InChI Key InChIKey=ZCANFQFOKQRQAW-UHFFFAOYSA-N
Data  2 IC50
  Tab Delimited (TSV)   2D SDfile   Computed 3D by Vconf -m prep SDfile
Find this compound or compounds like it in BindingDB:
Activity Spreadsheet -- Enzyme Inhibition Constant Data from BindingDB
Found 2 hits for monomerid = 8827
TargetVascular endothelial growth factor receptor 2(Homo sapiens (Human))
Dalian University
Curated by ChEMBL
LigandPNGBDBM8827(1-(4-{4-aminothieno[2,3-d]pyrimidin-5-yl}phenyl)-3...)
Affinity DataIC50:  182nM. Assay description: Inhibition of KDR
In DepthDetails ArticlePubMed
TargetVascular endothelial growth factor receptor 2(Homo sapiens (Human))
Dalian University
Curated by ChEMBL
LigandPNGBDBM8827(1-(4-{4-aminothieno[2,3-d]pyrimidin-5-yl}phenyl)-3...)
Affinity DataIC50:  180nM. Assay description: The assay uses purified enzyme interacting with biotinylated peptide substrate. HTRF is based on the proximity of europium cryptate (donor fluorophor...
In DepthDetails ArticlePubMed