BDBM88354 US9695128, 4
SMILES CC1COCC2N1C(=O)N(C2=O)c1c(F)cc(cc1F)C#Cc1ccccc1
InChI Key InChIKey=YSPHYSCJMVVPND-UHFFFAOYSA-N
Data  1 EC50
  Tab Delimited (TSV)   2D SDfile   Computed 3D by Vconf -m prep SDfile
Find this compound or compounds like it in BindingDB:
Activity Spreadsheet -- Enzyme Inhibition Constant Data from BindingDB
Found 1 hit for monomerid = 88354
TargetMetabotropic glutamate receptor 4(Homo sapiens (Human))
Hoffmann-La Roche
US Patent
LigandPNGBDBM88354(US9695128, 4)
Affinity DataEC50:  204nM. Assay description: A monoclonal HEK-293 cell line stably transfected with a cDNA encoding for the human mGlu4 receptor was generated; for the work with mGlu4 Positive A...
In DepthDetails US Patent