BDBM88362 US9695128, 12
SMILES Fc1cc(cc(F)c1N1C(=O)CN(C2CC2)C1=O)C#Cc1ccccc1
InChI Key InChIKey=NNRJYBWUTBEMJR-UHFFFAOYSA-N
Data  1 EC50
  Tab Delimited (TSV)   2D SDfile   Computed 3D by Vconf -m prep SDfile
Find this compound or compounds like it in BindingDB:
Activity Spreadsheet -- Enzyme Inhibition Constant Data from BindingDB
Found 1 hit for monomerid = 88362
TargetMetabotropic glutamate receptor 4(Homo sapiens (Human))
Hoffmann-La Roche
US Patent
LigandPNGBDBM88362(US9695128, 12)
Affinity DataEC50:  370nM. Assay description: A monoclonal HEK-293 cell line stably transfected with a cDNA encoding for the human mGlu4 receptor was generated; for the work with mGlu4 Positive A...
In DepthDetails US Patent