BDBM88460 (3-chloro-4,5-diethoxy-benzyl)-[2-(1H-indol-3-yl)ethyl]amine::MLS000698493::N-(3-chloro-4,5-diethoxybenzyl)-N-[2-(1H-indol-3-yl)ethyl]amine::N-[(3-chloranyl-4,5-diethoxy-phenyl)methyl]-2-(1H-indol-3-yl)ethanamine::N-[(3-chloro-4,5-diethoxyphenyl)methyl]-2-(1H-indol-3-yl)ethanamine::SMR000228921::cid_1818022
SMILES CCOc1cc(CNCCc2c[nH]c3ccccc23)cc(Cl)c1OCC
InChI Key InChIKey=APABSGRYLLJSEU-UHFFFAOYSA-N
Data  2 EC50
  Tab Delimited (TSV)   2D SDfile   Computed 3D by Vconf -m prep SDfile
Find this compound or compounds like it in BindingDB:
Activity Spreadsheet -- Enzyme Inhibition Constant Data from BindingDB
Found 2 hits for monomerid = 88460
TargetDelta-type opioid receptor(Homo sapiens (Human))
The Scripps Research Institute Molecular Screening Center
Curated by PubChem BioAssay
LigandPNGBDBM88460((3-chloro-4,5-diethoxy-benzyl)-[2-(1H-indol-3-yl)e...)
Affinity DataEC50: >9.25E+4nM. Assay description: Source (MLPCN Center Name): The Scripps Research Institute Molecular Screening Center (SRISMC) Center Affiliation: The Scripps Research Institute, TS...
In DepthDetails PCBioAssay
TargetMelanocortin receptor 4(Homo sapiens (Human))
The Scripps Research Institute Molecular Screening Center
Curated by PubChem BioAssay
LigandPNGBDBM88460((3-chloro-4,5-diethoxy-benzyl)-[2-(1H-indol-3-yl)e...)
Affinity DataEC50: >8.92E+4nM. Assay description: Source (MLPCN Center Name): The Scripps Research Institute Molecular Screening Center (SRISMC) Center Affiliation: The Scripps Research Institute, TS...
In DepthDetails PCBioAssay