BDBM88467 4-methyl-N-[2-[(3,6,7-trimethyl-2-quinolinyl)amino]ethyl]benzamide::4-methyl-N-[2-[(3,6,7-trimethyl-2-quinolyl)amino]ethyl]benzamide::4-methyl-N-[2-[(3,6,7-trimethylquinolin-2-yl)amino]ethyl]benzamide::MLS000688428::SMR000284360::cid_3206667
SMILES Cc1ccc(cc1)C(=O)NCCNc1nc2cc(C)c(C)cc2cc1C
InChI Key InChIKey=INLVGDOETIFUOM-UHFFFAOYSA-N
Data  2 EC50
  Tab Delimited (TSV)   2D SDfile   Computed 3D by Vconf -m prep SDfile
Find this compound or compounds like it in BindingDB:
Activity Spreadsheet -- Enzyme Inhibition Constant Data from BindingDB
Found 2 hits for monomerid = 88467
TargetDelta-type opioid receptor(Homo sapiens (Human))
The Scripps Research Institute Molecular Screening Center
Curated by PubChem BioAssay
LigandPNGBDBM88467(4-methyl-N-[2-[(3,6,7-trimethyl-2-quinolinyl)amino...)
Affinity DataEC50: >6.46E+4nM. Assay description: Source (MLPCN Center Name): The Scripps Research Institute Molecular Screening Center (SRISMC) Center Affiliation: The Scripps Research Institute, TS...
In DepthDetails PCBioAssay
TargetMelanocortin receptor 4(Homo sapiens (Human))
The Scripps Research Institute Molecular Screening Center
Curated by PubChem BioAssay
LigandPNGBDBM88467(4-methyl-N-[2-[(3,6,7-trimethyl-2-quinolinyl)amino...)
Affinity DataEC50: >8.92E+4nM. Assay description: Source (MLPCN Center Name): The Scripps Research Institute Molecular Screening Center (SRISMC) Center Affiliation: The Scripps Research Institute, TS...
In DepthDetails PCBioAssay