BDBM88506 MLS003124262::N-[6-(3-pyridinyl)-3-[3-(trifluoromethyl)phenyl]-8-imidazo[1,2-a]pyridinyl]acetamide::N-[6-(3-pyridyl)-3-[3-(trifluoromethyl)phenyl]imidazo[1,2-a]pyridin-8-yl]acetamide::N-[6-pyridin-3-yl-3-[3-(trifluoromethyl)phenyl]imidazo[1,2-a]pyridin-8-yl]acetamide::N-[6-pyridin-3-yl-3-[3-(trifluoromethyl)phenyl]imidazo[1,2-a]pyridin-8-yl]ethanamide::SMR001292797::cid_46942512
SMILES CC(=O)Nc1cc(cn2c(cnc12)-c1cccc(c1)C(F)(F)F)-c1cccnc1
InChI Key InChIKey=FPCKADRBYIWIBN-UHFFFAOYSA-N
Data  2 EC50
  Tab Delimited (TSV)   2D SDfile   Computed 3D by Vconf -m prep SDfile
Find this compound or compounds like it in BindingDB:
Activity Spreadsheet -- Enzyme Inhibition Constant Data from BindingDB
Found 2 hits for monomerid = 88506
TargetDelta-type opioid receptor(Homo sapiens (Human))
The Scripps Research Institute Molecular Screening Center
Curated by PubChem BioAssay
LigandPNGBDBM88506(MLS003124262 | N-[6-(3-pyridinyl)-3-[3-(trifluorom...)
Affinity DataEC50: >9.25E+4nM. Assay description: Source (MLPCN Center Name): The Scripps Research Institute Molecular Screening Center (SRISMC) Center Affiliation: The Scripps Research Institute, TS...
In DepthDetails PCBioAssay
TargetMelanocortin receptor 4(Homo sapiens (Human))
The Scripps Research Institute Molecular Screening Center
Curated by PubChem BioAssay
LigandPNGBDBM88506(MLS003124262 | N-[6-(3-pyridinyl)-3-[3-(trifluorom...)
Affinity DataEC50:  8.41E+4nM. Assay description: Source (MLPCN Center Name): The Scripps Research Institute Molecular Screening Center (SRISMC) Center Affiliation: The Scripps Research Institute, TS...
In DepthDetails PCBioAssay