BDBM88593 2-[(2-hydroxy-4,4-dimethyl-6-oxo-1-cyclohexen-1-yl)(2-thienyl)methyl]-5,5-dimethyl-1,3-cyclohexanedione::2-[(2-hydroxy-4,4-dimethyl-6-oxo-1-cyclohexenyl)-thiophen-2-ylmethyl]-5,5-dimethylcyclohexane-1,3-dione::2-[(2-hydroxy-4,4-dimethyl-6-oxocyclohexen-1-yl)-thiophen-2-ylmethyl]-5,5-dimethylcyclohexane-1,3-dione::2-[(2-hydroxy-6-keto-4,4-dimethyl-cyclohexen-1-yl)-(2-thienyl)methyl]-5,5-dimethyl-cyclohexane-1,3-quinone::2-[(4,4-dimethyl-2-oxidanyl-6-oxidanylidene-cyclohexen-1-yl)-thiophen-2-yl-methyl]-5,5-dimethyl-cyclohexane-1,3-dione::MLS000572484::SMR000194442::cid_3573522
SMILES CC1(C)CC(=O)C(C(C2C(=O)CC(C)(C)CC2=O)c2cccs2)C(=O)C1
InChI Key InChIKey=ZZIMEKBRWHMUEA-UHFFFAOYSA-N
Data  1 IC50
  Tab Delimited (TSV)   2D SDfile   Computed 3D by Vconf -m prep SDfile
Find this compound or compounds like it in BindingDB:
Activity Spreadsheet -- Enzyme Inhibition Constant Data from BindingDB
Found 1 hit for monomerid = 88593
TargetMelanocortin receptor 4(Homo sapiens (Human))
The Scripps Research Institute Molecular Screening Center
Curated by PubChem BioAssay
LigandPNGBDBM88593(2-[(2-hydroxy-4,4-dimethyl-6-oxo-1-cyclohexen-1-yl...)
Affinity DataIC50:  2.99E+4nM. Assay description: Source (MLPCN Center Name): The Scripps Research Institute Molecular Screening Center (SRISMC) Center Affiliation: The Scripps Research Institute, TS...
In DepthDetails PCBioAssay