BDBM88631 2-(4-imidazol-1-ylbenzylidene)malonic acid diethyl ester::2-[[4-(1-imidazolyl)phenyl]methylidene]propanedioic acid diethyl ester::MLS000755834::SMR000337506::cid_3296286::diethyl 2-[(4-imidazol-1-ylphenyl)methylidene]propanedioate::diethyl 2-{[4-(1H-imidazol-1-yl)phenyl]methylene}malonate
SMILES [#6]-[#6]-[#8]-[#6](=O)-[#6](=[#6]\c1ccc(cc1)-n1ccnc1)\[#6](=O)-[#8]-[#6]-[#6]
InChI Key InChIKey=COWHYAVISGJLBW-UHFFFAOYSA-N
Data  1 IC50
  Tab Delimited (TSV)   2D SDfile   Computed 3D by Vconf -m prep SDfile
Find this compound or compounds like it in BindingDB:
Activity Spreadsheet -- Enzyme Inhibition Constant Data from BindingDB
Found 1 hit for monomerid = 88631
TargetMelanocortin receptor 4(Homo sapiens (Human))
The Scripps Research Institute Molecular Screening Center
Curated by PubChem BioAssay
LigandPNGBDBM88631(2-(4-imidazol-1-ylbenzylidene)malonic acid diethyl...)
Affinity DataIC50: >6.46E+4nM. Assay description: Source (MLPCN Center Name): The Scripps Research Institute Molecular Screening Center (SRISMC) Center Affiliation: The Scripps Research Institute, TS...
In DepthDetails PCBioAssay