BDBM88636 (E)-3-[3-(2,3-dihydro-1,4-benzodioxin-6-yl)-1-phenyl-4-pyrazolyl]-1-(4-methyl-1-piperazinyl)-2-propen-1-one;hydrochloride::(E)-3-[3-(2,3-dihydro-1,4-benzodioxin-6-yl)-1-phenyl-pyrazol-4-yl]-1-(4-methylpiperazin-1-yl)prop-2-en-1-one;hydrochloride::(E)-3-[3-(2,3-dihydro-1,4-benzodioxin-6-yl)-1-phenyl-pyrazol-4-yl]-1-(4-methylpiperazino)prop-2-en-1-one;hydrochloride::(E)-3-[3-(2,3-dihydro-1,4-benzodioxin-6-yl)-1-phenylpyrazol-4-yl]-1-(4-methylpiperazin-1-yl)prop-2-en-1-one;hydrochloride::MLS001017984::SMR000354251::cid_16196078
SMILES CN1CCN(CC1)C(=O)\C=C\c1cn(nc1-c1ccc2OCCOc2c1)-c1ccccc1
InChI Key InChIKey=NAACUODJWGVTLU-CSKARUKUSA-N
Data  1 IC50
  Tab Delimited (TSV)   2D SDfile   Computed 3D by Vconf -m prep SDfile
Find this compound or compounds like it in BindingDB:
Activity Spreadsheet -- Enzyme Inhibition Constant Data from BindingDB
Found 1 hit for monomerid = 88636
TargetMelanocortin receptor 4(Homo sapiens (Human))
The Scripps Research Institute Molecular Screening Center
Curated by PubChem BioAssay
LigandPNGBDBM88636((E)-3-[3-(2,3-dihydro-1,4-benzodioxin-6-yl)-1-phen...)
Affinity DataIC50: >6.46E+4nM. Assay description: Source (MLPCN Center Name): The Scripps Research Institute Molecular Screening Center (SRISMC) Center Affiliation: The Scripps Research Institute, TS...
In DepthDetails PCBioAssay