BDBM88639 1-benzyl-N-(4-fluoro-3-nitro-phenyl)-5-keto-pyrrolidine-3-carboxamide::1-benzyl-N-(4-fluoro-3-nitrophenyl)-5-oxopyrrolidine-3-carboxamide::MLS001006238::N-(4-fluoranyl-3-nitro-phenyl)-5-oxidanylidene-1-(phenylmethyl)pyrrolidine-3-carboxamide::N-(4-fluoro-3-nitrophenyl)-5-oxo-1-(phenylmethyl)-3-pyrrolidinecarboxamide::SMR000384316::cid_4884316
SMILES [O-][N+](=O)c1cc(NC(=O)C2CN(Cc3ccccc3)C(=O)C2)ccc1F
InChI Key InChIKey=MWUZMCTYZYVMQS-UHFFFAOYSA-N
Data  1 IC50
  Tab Delimited (TSV)   2D SDfile   Computed 3D by Vconf -m prep SDfile
Find this compound or compounds like it in BindingDB:
Activity Spreadsheet -- Enzyme Inhibition Constant Data from BindingDB
Found 1 hit for monomerid = 88639
TargetMelanocortin receptor 4(Homo sapiens (Human))
The Scripps Research Institute Molecular Screening Center
Curated by PubChem BioAssay
LigandPNGBDBM88639(1-benzyl-N-(4-fluoro-3-nitro-phenyl)-5-keto-pyrrol...)
Affinity DataIC50: >6.46E+4nM. Assay description: Source (MLPCN Center Name): The Scripps Research Institute Molecular Screening Center (SRISMC) Center Affiliation: The Scripps Research Institute, TS...
In DepthDetails PCBioAssay