BDBM88646 3-(4-methoxyphenyl)-N-[3-methoxy-5-[[3-(trifluoromethyl)phenyl]carbamoyl]phenyl]-1H-pyrazole-5-carboxamide::MLS000911494::N-[3-methoxy-5-[oxo-[3-(trifluoromethyl)anilino]methyl]phenyl]-3-(4-methoxyphenyl)-1H-pyrazole-5-carboxamide::SMR000453544::cid_16745784
SMILES COc1ccc(cc1)-c1cc([nH]n1)C(=O)Nc1cc(OC)cc(c1)C(=O)Nc1cccc(c1)C(F)(F)F
InChI Key InChIKey=QAUXZQDHMVPPEH-UHFFFAOYSA-N
Data  1 IC50
  Tab Delimited (TSV)   2D SDfile   Computed 3D by Vconf -m prep SDfile
Find this compound or compounds like it in BindingDB:
Activity Spreadsheet -- Enzyme Inhibition Constant Data from BindingDB
Found 1 hit for monomerid = 88646
TargetMelanocortin receptor 4(Homo sapiens (Human))
The Scripps Research Institute Molecular Screening Center
Curated by PubChem BioAssay
LigandPNGBDBM88646(3-(4-methoxyphenyl)-N-[3-methoxy-5-[[3-(trifluorom...)
Affinity DataIC50: >6.46E+4nM. Assay description: Source (MLPCN Center Name): The Scripps Research Institute Molecular Screening Center (SRISMC) Center Affiliation: The Scripps Research Institute, TS...
In DepthDetails PCBioAssay