BDBM89008 2-(2-ethylphenoxy)-N-(2-methyl-4-pyrrolidin-1-yl-phenyl)ethanamide::2-(2-ethylphenoxy)-N-(2-methyl-4-pyrrolidin-1-ylphenyl)acetamide::2-(2-ethylphenoxy)-N-(2-methyl-4-pyrrolidino-phenyl)acetamide::2-(2-ethylphenoxy)-N-[2-methyl-4-(1-pyrrolidinyl)phenyl]acetamide::MLS002161030::SMR001243458::cid_4853066
SMILES CCc1ccccc1OCC(=O)Nc1ccc(cc1C)N1CCCC1
InChI Key InChIKey=BWVQJXWDZCDJJJ-UHFFFAOYSA-N
Data  2 IC50
  Tab Delimited (TSV)   2D SDfile   Computed 3D by Vconf -m prep SDfile
Find this compound or compounds like it in BindingDB:
Activity Spreadsheet -- Enzyme Inhibition Constant Data from BindingDB
Found 2 hits for monomerid = 89008
Target26S proteasome non-ATPase regulatory subunit 14(Homo sapiens (Human))
Burnham Center For Chemical Genomics
Curated by PubChem BioAssay
LigandPNGBDBM89008(2-(2-ethylphenoxy)-N-(2-methyl-4-pyrrolidin-1-yl-p...)
Affinity DataIC50:  4.62E+4nM. Assay description: Data Source: Sanford-Burnham Center for Chemical Genomics (SBCCG) Source Affiliation: Sanford Burnham Medical Research Institute (SBMRI, La Jolla, CA...
In DepthDetails PCBioAssay
TargetProthrombin(Bos taurus (Bovine))
Burnham Center For Chemical Genomics
Curated by PubChem BioAssay
LigandPNGBDBM89008(2-(2-ethylphenoxy)-N-(2-methyl-4-pyrrolidin-1-yl-p...)
Affinity DataIC50:  9.96E+3nM. Assay description: Data Source: Sanford-Burnham Center for Chemical Genomics (SBCCG) Source Affiliation: Sanford Burnham Medical Research Institute (SBMRI, La Jolla, CA...
In DepthDetails PCBioAssay