BDBM89090 3,7-dimethyl-N-[4-(4-methylsulfonyl-1-piperazinyl)phenyl]-5-oxo-6-thiazolo[3,2-a]pyrimidinesulfonamide::3,7-dimethyl-N-[4-(4-methylsulfonylpiperazin-1-yl)phenyl]-5-oxidanylidene-[1,3]thiazolo[3,2-a]pyrimidine-6-sulfonamide::3,7-dimethyl-N-[4-(4-methylsulfonylpiperazin-1-yl)phenyl]-5-oxo-[1,3]thiazolo[3,2-a]pyrimidine-6-sulfonamide::5-keto-N-[4-(4-mesylpiperazino)phenyl]-3,7-dimethyl-thiazolo[3,2-a]pyrimidine-6-sulfonamide::MLS-0364932.0001::cid_15990078
SMILES Cc1csc2nc(C)c(c(=O)n12)S(=O)(=O)Nc1ccc(cc1)N1CCN(CC1)S(C)(=O)=O
InChI Key InChIKey=PIZYKAHKGPBDEX-UHFFFAOYSA-N
Data  3 IC50
  Tab Delimited (TSV)   2D SDfile   Computed 3D by Vconf -m prep SDfile
Find this compound or compounds like it in BindingDB:
Activity Spreadsheet -- Enzyme Inhibition Constant Data from BindingDB
Found 3 hits for monomerid = 89090
TargetMitochondrial import inner membrane translocase subunit TIM23(Saccharomyces cerevisiae S288c)
Burnham Center For Chemical Genomics
Curated by PubChem BioAssay
LigandPNGBDBM89090(3,7-dimethyl-N-[4-(4-methylsulfonyl-1-piperazinyl)...)
Affinity DataIC50: >9.90E+4nM. Assay description: Data Source: Sanford-Burnham Center for Chemical Genomics (SBCCG) Source Affiliation: Sanford-Burnham Medical Research Institute(SBMRI, San Diego, CA...
In DepthDetails PCBioAssay
TargetMitochondrial import inner membrane translocase subunit TIM10(Saccharomyces cerevisiae S288c)
Burnham Center For Chemical Genomics
Curated by PubChem BioAssay
LigandPNGBDBM89090(3,7-dimethyl-N-[4-(4-methylsulfonyl-1-piperazinyl)...)
Affinity DataIC50: >9.90E+4nM. Assay description: Data Source: Sanford-Burnham Center for Chemical Genomics (SBCCG) Source Affiliation: Sanford-Burnham Medical Research Institute(SBMRI, San Diego, CA...
In DepthDetails PCBioAssay
TargetMitochondrial import inner membrane translocase subunit TIM10(Saccharomyces cerevisiae S288c)
Burnham Center For Chemical Genomics
Curated by PubChem BioAssay
LigandPNGBDBM89090(3,7-dimethyl-N-[4-(4-methylsulfonyl-1-piperazinyl)...)
Affinity DataIC50: >9.90E+4nM. Assay description: Data Source: Sanford-Burnham Center for Chemical Genomics (SBCCG) Source Affiliation: Sanford-Burnham Medical Research Institute(SBMRI, San Diego, CA...
In DepthDetails PCBioAssay