BDBM89101 2-[[3-chloranyl-5-(trifluoromethyl)pyridin-2-yl]sulfanylmethyl]-7-methyl-pyrido[1,2-a]pyrimidin-4-one::2-[[3-chloro-5-(trifluoromethyl)pyridin-2-yl]sulfanylmethyl]-7-methylpyrido[1,2-a]pyrimidin-4-one::2-[[[3-chloro-5-(trifluoromethyl)-2-pyridinyl]thio]methyl]-7-methyl-4-pyrido[1,2-a]pyrimidinone::2-[[[3-chloro-5-(trifluoromethyl)-2-pyridyl]thio]methyl]-7-methyl-pyrido[1,2-a]pyrimidin-4-one::MLS-0463369.0001::cid_2085985
SMILES Cc1ccc2nc(CSc3ncc(cc3Cl)C(F)(F)F)cc(=O)n2c1
InChI Key InChIKey=QNEVZOFUXQZYFE-UHFFFAOYSA-N
Data  3 IC50
  Tab Delimited (TSV)   2D SDfile   Computed 3D by Vconf -m prep SDfile
Find this compound or compounds like it in BindingDB:
Activity Spreadsheet -- Enzyme Inhibition Constant Data from BindingDB
Found 3 hits for monomerid = 89101
TargetMitochondrial import inner membrane translocase subunit TIM23(Saccharomyces cerevisiae S288c)
Burnham Center For Chemical Genomics
Curated by PubChem BioAssay
LigandPNGBDBM89101(2-[[3-chloranyl-5-(trifluoromethyl)pyridin-2-yl]su...)
Affinity DataIC50:  6.74E+4nM. Assay description: Data Source: Sanford-Burnham Center for Chemical Genomics (SBCCG) Source Affiliation: Sanford-Burnham Medical Research Institute(SBMRI, San Diego, CA...
In DepthDetails PCBioAssay
TargetMitochondrial import inner membrane translocase subunit TIM10(Saccharomyces cerevisiae S288c)
Burnham Center For Chemical Genomics
Curated by PubChem BioAssay
LigandPNGBDBM89101(2-[[3-chloranyl-5-(trifluoromethyl)pyridin-2-yl]su...)
Affinity DataIC50: >9.90E+4nM. Assay description: Data Source: Sanford-Burnham Center for Chemical Genomics (SBCCG) Source Affiliation: Sanford-Burnham Medical Research Institute(SBMRI, San Diego, CA...
In DepthDetails PCBioAssay
TargetMitochondrial import inner membrane translocase subunit TIM10(Saccharomyces cerevisiae S288c)
Burnham Center For Chemical Genomics
Curated by PubChem BioAssay
LigandPNGBDBM89101(2-[[3-chloranyl-5-(trifluoromethyl)pyridin-2-yl]su...)
Affinity DataIC50:  7.89E+4nM. Assay description: Data Source: Sanford-Burnham Center for Chemical Genomics (SBCCG) Source Affiliation: Sanford-Burnham Medical Research Institute(SBMRI, San Diego, CA...
In DepthDetails PCBioAssay