BDBM89112 2-[(7-bromanyl-4-oxidanylidene-pyrido[1,2-a]pyrimidin-2-yl)methylsulfanyl]-4,5,6-trimethyl-pyridine-3-carbonitrile::2-[(7-bromo-4-keto-pyrido[1,2-a]pyrimidin-2-yl)methylthio]-4,5,6-trimethyl-nicotinonitrile::2-[(7-bromo-4-oxo-2-pyrido[1,2-a]pyrimidinyl)methylthio]-4,5,6-trimethyl-3-pyridinecarbonitrile::2-[(7-bromo-4-oxopyrido[1,2-a]pyrimidin-2-yl)methylsulfanyl]-4,5,6-trimethylpyridine-3-carbonitrile::MLS-0463379.0001::cid_18776006
SMILES Cc1nc(SCc2cc(=O)n3cc(Br)ccc3n2)c(C#N)c(C)c1C
InChI Key InChIKey=BTDAHCYFTROTOW-UHFFFAOYSA-N
Data  3 IC50
  Tab Delimited (TSV)   2D SDfile   Computed 3D by Vconf -m prep SDfile
Find this compound or compounds like it in BindingDB:
Activity Spreadsheet -- Enzyme Inhibition Constant Data from BindingDB
Found 3 hits for monomerid = 89112
TargetMitochondrial import inner membrane translocase subunit TIM23(Saccharomyces cerevisiae S288c)
Burnham Center For Chemical Genomics
Curated by PubChem BioAssay
LigandPNGBDBM89112(2-[(7-bromanyl-4-oxidanylidene-pyrido[1,2-a]pyrimi...)
Affinity DataIC50: >9.90E+4nM. Assay description: Data Source: Sanford-Burnham Center for Chemical Genomics (SBCCG) Source Affiliation: Sanford-Burnham Medical Research Institute(SBMRI, San Diego, CA...
In DepthDetails PCBioAssay
TargetMitochondrial import inner membrane translocase subunit TIM10(Saccharomyces cerevisiae S288c)
Burnham Center For Chemical Genomics
Curated by PubChem BioAssay
LigandPNGBDBM89112(2-[(7-bromanyl-4-oxidanylidene-pyrido[1,2-a]pyrimi...)
Affinity DataIC50: >9.90E+4nM. Assay description: Data Source: Sanford-Burnham Center for Chemical Genomics (SBCCG) Source Affiliation: Sanford-Burnham Medical Research Institute(SBMRI, San Diego, CA...
In DepthDetails PCBioAssay
TargetMitochondrial import inner membrane translocase subunit TIM10(Saccharomyces cerevisiae S288c)
Burnham Center For Chemical Genomics
Curated by PubChem BioAssay
LigandPNGBDBM89112(2-[(7-bromanyl-4-oxidanylidene-pyrido[1,2-a]pyrimi...)
Affinity DataIC50:  8.81E+4nM. Assay description: Data Source: Sanford-Burnham Center for Chemical Genomics (SBCCG) Source Affiliation: Sanford-Burnham Medical Research Institute(SBMRI, San Diego, CA...
In DepthDetails PCBioAssay