BDBM89179 Furan-2-carboxylic acid (5-octyl-[1,3,4]thiadiazol-2-yl)-amide::MLS000525796::N-(5-octyl-1,3,4-thiadiazol-2-yl)-2-furamide::N-(5-octyl-1,3,4-thiadiazol-2-yl)-2-furancarboxamide::N-(5-octyl-1,3,4-thiadiazol-2-yl)furan-2-carboxamide::SMR000116270::cid_3099856
SMILES CCCCCCCCc1nnc(NC(=O)c2ccco2)s1
InChI Key InChIKey=OMZKKAXWKCSIGR-UHFFFAOYSA-N
Data  1 IC50
  Tab Delimited (TSV)   2D SDfile   Computed 3D by Vconf -m prep SDfile
Find this compound or compounds like it in BindingDB:
Activity Spreadsheet -- Enzyme Inhibition Constant Data from BindingDB
Found 1 hit for monomerid = 89179
TargetDNA (cytosine-5)-methyltransferase 1(Homo sapiens (Human))
Burnham Center For Chemical Genomics
Curated by PubChem BioAssay
LigandPNGBDBM89179(Furan-2-carboxylic acid (5-octyl-[1,3,4]thiadiazol...)
Affinity DataIC50:  4.24E+4nM. Assay description: Data Source: Sanford-Burnham Center for Chemical Genomics (SBCCG) Source Affiliation: Sanford-Burnham Medical Research Institute (SBMRI, San Diego, C...
In DepthDetails PCBioAssay