BDBM89189 2-{4-[(4-Hydroxy-benzoyl)-hydrazonomethyl]-phenoxy}-N-(4-nitro-phenyl)-acetamide::4-hydroxy-N-[(E)-[4-[2-(4-nitroanilino)-2-oxoethoxy]phenyl]methylideneamino]benzamide::4-hydroxy-N-[(E)-[4-[2-keto-2-(4-nitroanilino)ethoxy]benzylidene]amino]benzamide::MLS000548295::N-[(E)-[4-[2-[(4-nitrophenyl)amino]-2-oxidanylidene-ethoxy]phenyl]methylideneamino]-4-oxidanyl-benzamide::SMR000171643::cid_9593324
SMILES Oc1ccc(cc1)C(=O)N\N=C\c1ccc(OCC(=O)Nc2ccc(cc2)[N+]([O-])=O)cc1
InChI Key InChIKey=OUKYUDXZLWMXQT-YDZHTSKRSA-N
Data  3 IC50
  Tab Delimited (TSV)   2D SDfile   Computed 3D by Vconf -m prep SDfile
Find this compound or compounds like it in BindingDB:
Activity Spreadsheet -- Enzyme Inhibition Constant Data from BindingDB
Found 3 hits for monomerid = 89189
TargetDNA (cytosine-5)-methyltransferase 1(Homo sapiens (Human))
Burnham Center For Chemical Genomics
Curated by PubChem BioAssay
LigandPNGBDBM89189(2-{4-[(4-Hydroxy-benzoyl)-hydrazonomethyl]-phenoxy...)
Affinity DataIC50:  8.43E+3nM. Assay description: Data Source: Sanford-Burnham Center for Chemical Genomics (SBCCG) Source Affiliation: Sanford-Burnham Medical Research Institute (SBMRI, San Diego, C...
In DepthDetails PCBioAssay
TargetLow molecular weight phosphotyrosine protein phosphatase(Homo sapiens (Human))
Burnham Center For Chemical Genomics
Curated by PubChem BioAssay
LigandPNGBDBM89189(2-{4-[(4-Hydroxy-benzoyl)-hydrazonomethyl]-phenoxy...)
Affinity DataIC50: >8.00E+4nM
In DepthDetails PCBioAssay
TargetLow molecular weight phosphotyrosine protein phosphatase(Homo sapiens (Human))
Burnham Center For Chemical Genomics
Curated by PubChem BioAssay
LigandPNGBDBM89189(2-{4-[(4-Hydroxy-benzoyl)-hydrazonomethyl]-phenoxy...)
Affinity DataIC50:  9.58E+3nM
In DepthDetails PCBioAssay