BDBM89246 4-(4-Benzothiazol-2-yl-piperidine-1-sulfonyl)-N,N-diethyl-benzamide::4-[4-(1,3-benzothiazol-2-yl)piperidin-1-yl]sulfonyl-N,N-diethyl-benzamide::4-[4-(1,3-benzothiazol-2-yl)piperidin-1-yl]sulfonyl-N,N-diethylbenzamide::4-[4-(1,3-benzothiazol-2-yl)piperidino]sulfonyl-N,N-diethyl-benzamide::4-[[4-(1,3-benzothiazol-2-yl)-1-piperidinyl]sulfonyl]-N,N-diethylbenzamide::MLS000123581::SMR000124127::cid_1436935
SMILES CCN(CC)C(=O)c1ccc(cc1)S(=O)(=O)N1CCC(CC1)c1nc2ccccc2s1
InChI Key InChIKey=VVTAGOBCXSBFQI-UHFFFAOYSA-N
Data  2 IC50
  Tab Delimited (TSV)   2D SDfile   Computed 3D by Vconf -m prep SDfile
Find this compound or compounds like it in BindingDB:
Activity Spreadsheet -- Enzyme Inhibition Constant Data from BindingDB
Found 2 hits for monomerid = 89246
TargetProtein Wnt-3a(Mus musculus)
Burnham Center For Chemical Genomics
Curated by PubChem BioAssay
LigandPNGBDBM89246(4-(4-Benzothiazol-2-yl-piperidine-1-sulfonyl)-N,N-...)
Affinity DataIC50:  3.97E+4nM
In DepthDetails PCBioAssay
TargetZinc finger protein GLI1(Mus musculus)
Burnham Center For Chemical Genomics
Curated by PubChem BioAssay
LigandPNGBDBM89246(4-(4-Benzothiazol-2-yl-piperidine-1-sulfonyl)-N,N-...)
Affinity DataIC50:  8.85E+3nM. Assay description: Data Source: Sanford-Burnham Center for Chemical Genomics (SBCCG) Source Affiliation: Sanford-Burnham Medical Research Institute (SBMRI, San Diego, C...
In DepthDetails PCBioAssay