BDBM89295 MLS000394723::N-[3-(1-azepanylsulfonyl)phenyl]-2-(3,4-dimethoxyphenyl)acetamide::N-[3-(azepan-1-ylsulfonyl)phenyl]-2-(3,4-dimethoxyphenyl)acetamide::N-[3-(azepan-1-ylsulfonyl)phenyl]-2-(3,4-dimethoxyphenyl)ethanamide::SMR000242803::cid_3436736
SMILES COc1ccc(CC(=O)Nc2cccc(c2)S(=O)(=O)N2CCCCCC2)cc1OC
InChI Key InChIKey=HFEMNXBPKYRZJR-UHFFFAOYSA-N
Data  2 IC50
  Tab Delimited (TSV)   2D SDfile   Computed 3D by Vconf -m prep SDfile
Find this compound or compounds like it in BindingDB:
Activity Spreadsheet -- Enzyme Inhibition Constant Data from BindingDB
Found 2 hits for monomerid = 89295
TargetProtein Wnt-3a(Mus musculus)
Burnham Center For Chemical Genomics
Curated by PubChem BioAssay
LigandPNGBDBM89295(MLS000394723 | N-[3-(1-azepanylsulfonyl)phenyl]-2-...)
Affinity DataIC50:  1.73E+3nM
In DepthDetails PCBioAssay
TargetZinc finger protein GLI1(Mus musculus)
Burnham Center For Chemical Genomics
Curated by PubChem BioAssay
LigandPNGBDBM89295(MLS000394723 | N-[3-(1-azepanylsulfonyl)phenyl]-2-...)
Affinity DataIC50:  7.98E+3nM. Assay description: Data Source: Sanford-Burnham Center for Chemical Genomics (SBCCG) Source Affiliation: Sanford-Burnham Medical Research Institute (SBMRI, San Diego, C...
In DepthDetails PCBioAssay