BDBM89307 4-[5-(6-quinolyloxymethyl)isoxazole-3-carbonyl]piperazine-1-carboxylic acid ethyl ester::4-[oxo-[5-(6-quinolinyloxymethyl)-3-isoxazolyl]methyl]-1-piperazinecarboxylic acid ethyl ester::MLS000732293::SMR000318886::cid_16187802::ethyl 4-({5-[(quinolin-6-yloxy)methyl]isoxazol-3-yl}carbonyl)piperazine-1-carboxylate::ethyl 4-[5-(quinolin-6-yloxymethyl)-1,2-oxazole-3-carbonyl]piperazine-1-carboxylate::ethyl 4-[[5-(quinolin-6-yloxymethyl)-1,2-oxazol-3-yl]carbonyl]piperazine-1-carboxylate
SMILES CCOC(=O)N1CCN(CC1)C(=O)c1cc(COc2ccc3ncccc3c2)on1
InChI Key InChIKey=JSNNCQGVRDRQNT-UHFFFAOYSA-N
Data  2 IC50
  Tab Delimited (TSV)   2D SDfile   Computed 3D by Vconf -m prep SDfile
Find this compound or compounds like it in BindingDB:
Activity Spreadsheet -- Enzyme Inhibition Constant Data from BindingDB
Found 2 hits for monomerid = 89307
TargetProtein Wnt-3a(Mus musculus)
Burnham Center For Chemical Genomics
Curated by PubChem BioAssay
LigandPNGBDBM89307(4-[5-(6-quinolyloxymethyl)isoxazole-3-carbonyl]pip...)
Affinity DataIC50:  555nM
In DepthDetails PCBioAssay
TargetZinc finger protein GLI1(Mus musculus)
Burnham Center For Chemical Genomics
Curated by PubChem BioAssay
LigandPNGBDBM89307(4-[5-(6-quinolyloxymethyl)isoxazole-3-carbonyl]pip...)
Affinity DataIC50:  6.71E+3nM. Assay description: Data Source: Sanford-Burnham Center for Chemical Genomics (SBCCG) Source Affiliation: Sanford-Burnham Medical Research Institute (SBMRI, San Diego, C...
In DepthDetails PCBioAssay