BDBM90832 2-[4-[[(E)-N'-(4,6-dimethylpyrimidin-2-yl)amidino]amino]phenyl]acetic acid isopropyl ester::2-[4-[[(E)-amino-[(4,6-dimethyl-2-pyrimidinyl)imino]methyl]amino]phenyl]acetic acid propan-2-yl ester::MLS001210702::SMR000519156::cid_5736210::propan-2-yl 2-[4-[[(E)-N'-(4,6-dimethylpyrimidin-2-yl)carbamimidoyl]amino]phenyl]acetate::propan-2-yl 2-[4-[[(E)-N'-(4,6-dimethylpyrimidin-2-yl)carbamimidoyl]amino]phenyl]ethanoate::{4-[N'-(4,6-Dimethyl-pyrimidin-2-yl)-guanidino]-phenyl}-acetic acid isopropyl ester
SMILES CC(C)OC(=O)Cc1ccc(cc1)N=C(N)Nc1nc(C)cc(C)n1
InChI Key InChIKey=OHBHFJWVCSTFER-UHFFFAOYSA-N
Data  1 EC50
  Tab Delimited (TSV)   2D SDfile   Computed 3D by Vconf -m prep SDfile
Find this compound or compounds like it in BindingDB:
Activity Spreadsheet -- Enzyme Inhibition Constant Data from BindingDB
Found 1 hit for monomerid = 90832
TargetCorticotropin-releasing factor-binding protein(Homo sapiens (Human))
Burnham Center For Chemical Genomics
Curated by PubChem BioAssay
LigandPNGBDBM90832(2-[4-[[(E)-N'-(4,6-dimethylpyrimidin-2-yl)amidino]...)
Affinity DataEC50:  2.56E+3nM. Assay description: Data Source: Sanford-Burnham Center for Chemical Genomics (SBCCG) Source Affiliation: Sanford-Burnham Medical Research Institute (SBMRI, San Diego, C...
Ligand InfoPC cidPC sid
In DepthDetails PCBioAssay