BDBM91534 7-(2-thienyl)pyrazolo[1,5-a]pyrimidine-2-carboxylic acid::7-thiophen-2-yl-2-pyrazolo[1,5-a]pyrimidinecarboxylic acid::7-thiophen-2-ylpyrazolo[1,5-a]pyrimidine-2-carboxylic acid::MLS-0471589.0001::cid_6485368
SMILES OC(=O)c1cc2nccc(-c3cccs3)n2n1
InChI Key InChIKey=LRZOJAAEMGPNBK-UHFFFAOYSA-N
Data  2 IC50
  Tab Delimited (TSV)   2D SDfile   Computed 3D by Vconf -m prep SDfile
Find this compound or compounds like it in BindingDB:
Activity Spreadsheet -- Enzyme Inhibition Constant Data from BindingDB
Found 2 hits for monomerid = 91534
TargetDNA dC->dU-editing enzyme APOBEC-3A(Homo sapiens (Human))
Burnham Center For Chemical Genomics
Curated by PubChem BioAssay
LigandPNGBDBM91534(7-(2-thienyl)pyrazolo[1,5-a]pyrimidine-2-carboxyli...)
Affinity DataIC50: >9.90E+4nMT: 2°C. Assay description: Data Source: Sanford-Burnham Center for Chemical Genomics (SBCCG) Source Affiliation: Sanford-Burnham Medical Research Institute (SBMRI, San Diego, C...
In DepthDetails PCBioAssay
TargetDNA dC->dU-editing enzyme APOBEC-3G(Homo sapiens (Human))
Burnham Center For Chemical Genomics
Curated by PubChem BioAssay
LigandPNGBDBM91534(7-(2-thienyl)pyrazolo[1,5-a]pyrimidine-2-carboxyli...)
Affinity DataIC50: >9.90E+4nMT: 2°C. Assay description: Data Source: Sanford-Burnham Center for Chemical Genomics (SBCCG) Source Affiliation: Sanford-Burnham Medical Research Institute (SBMRI, San Diego, C...
In DepthDetails PCBioAssay