BDBM91672 N-aryl-4-aryl-1,3-thiazole-2-amine, 29
SMILES Nc1ccccc1Nc1nc(cs1)-c1ccc(Cl)cc1
InChI Key InChIKey=WKKROPZVKWEYLH-UHFFFAOYSA-N
Data  1 IC50
  Tab Delimited (TSV)   2D SDfile   Computed 3D by Vconf -m prep SDfile
Find this compound or compounds like it in BindingDB:
Activity Spreadsheet -- Enzyme Inhibition Constant Data from BindingDB
Found 1 hit for monomerid = 91672
TargetPolyunsaturated fatty acid 5-lipoxygenase(Homo sapiens (Human))
Korea Research Institute Of Chemical Technology
LigandPNGBDBM91672(N-aryl-4-aryl-1,3-thiazole-2-amine, 29)
Affinity DataIC50:  421nMpH: 7.4 T: 2°C. Assay description: 5-LOX enzyme assay was carried out with some modifications of ferric oxidation of xylenol orange (FOX) assay, which is based on the complex formation...
In DepthDetails ArticlePubMed