BDBM91693 Thiosemicarbazone, 2f
SMILES FC(F)(F)c1cccc(NS#CN\N=C2/C(=O)Nc3ccccc23)c1
InChI Key InChIKey=LPXKKJSHWFFMCG-UHFFFAOYSA-N
Data  1 IC50
  Tab Delimited (TSV)   2D SDfile   Computed 3D by Vconf -m prep SDfile
Find this compound or compounds like it in BindingDB:
Activity Spreadsheet -- Enzyme Inhibition Constant Data from BindingDB
Found 1 hit for monomerid = 91693
TargetUrease(Canavalia ensiformis (Jack bean) (Horse bean))
Bahauddin Zakariya University
LigandPNGBDBM91693(Thiosemicarbazone, 2f)
Affinity DataIC50:  2.06E+4nM. Assay description: Inhibition assay using urease from jack bean.
In DepthDetails ArticlePubMed