BDBM91958 Chk1_9
SMILES [O-][N+](=O)c1ccc(NC(=O)Nc2cnc(cn2)C#N)cc1
InChI Key InChIKey=HJUZPXRLFXXNQZ-UHFFFAOYSA-N
Data  1 KI  1 IC50
  Tab Delimited (TSV)   2D SDfile   Computed 3D by Vconf -m prep SDfile
Find this compound or compounds like it in BindingDB:
Activity Spreadsheet -- Enzyme Inhibition Constant Data from BindingDB
Found 2 hits for monomerid = 91958
TargetSerine/threonine-protein kinase Chk1 [2-280](Homo sapiens (Human))
D3R/Abbott
LigandPNGBDBM91958(Chk1_9)
Affinity DataKi: >1.00E+4nM. Assay description: 33P-Radiometric_Method1
Ligand InfoKEGGPC cidPC sid
In DepthDetails PubMed
TargetSerine/threonine-protein kinase Chk1(Homo sapiens (Human))
Csar
LigandPNGBDBM91958(Chk1_9)
Affinity DataIC50:  1.00E+4nM. Assay description: Abbott Kinase Enzymatics_CHK1/289 CDC25c - IC50(uM) (IC50)
Ligand InfoKEGGPC cidPC sid
In DepthDetails PubMed