BDBM92075 erk000501
SMILES Cc1cnc(nc1-c1c[nH]c(c1)C(=O)N[C@H](CO)c1ccccc1)-c1ccccc1
InChI Key InChIKey=FNNBPGRLZUMRCC-OAQYLSRUSA-N
Data  2 KI
PDB links: 1 PDB ID matches this monomer.
  Tab Delimited (TSV)   2D SDfile   Computed 3D by Vconf -m prep SDfile
Find this compound or compounds like it in BindingDB:
Activity Spreadsheet -- Enzyme Inhibition Constant Data from BindingDB
Found 2 hits for monomerid = 92075
TargetMitogen-activated protein kinase 1(Homo sapiens (Human))
D3R/Abbott
LigandPNGBDBM92075(erk000501)
Affinity DataKi:  20nM. Assay description: Photometric_Method2
TargetMitogen-activated protein kinase 1(Homo sapiens (Human))
D3R/Abbott
LigandPNGBDBM92075(erk000501)
Affinity DataKi:  20nM. Assay description: Assay 1 ...