BDBM92255 CS021::CS21
SMILES CC1(CNC(=O)c2ccc(cc2)-c2ccccc2)NC(=O)NC1=O
InChI Key InChIKey=SYWVTXVIWMDALI-UHFFFAOYSA-N
Data  2 Kd
  Tab Delimited (TSV)   2D SDfile   Computed 3D by Vconf -m prep SDfile
Find this compound or compounds like it in BindingDB:
Activity Spreadsheet -- Enzyme Inhibition Constant Data from BindingDB
Found 2 hits for monomerid = 92255
TargetUDP-3-O-acyl-N-acetylglucosamine deacetylase(Pseudomonas aeruginosa)
D3R/Abbott
LigandPNGBDBM92255(CS021 | CS21)
Affinity DataKd: >1.00E+5nM. Assay description: Thermofluor_Method1
In DepthDetails PubMed
LigandPNGBDBM92255(CS021 | CS21)
Affinity DataKd: >1.00E+5nMpH: 7.0 T: 2°C. Assay description: Thermofluor
In DepthDetails PubMed