BDBM92266 CS256
SMILES C[C@@H](O)[C@H](NC(=O)c1ccc(cc1)-c1ccc(Br)cc1)C(=O)NCC1(C)NC(=O)NC1=O
InChI Key InChIKey=RIKFCPPKCHFGKR-PYQMWLELSA-N
Data  2 Kd
  Tab Delimited (TSV)   2D SDfile   Computed 3D by Vconf -m prep SDfile
Find this compound or compounds like it in BindingDB:
Activity Spreadsheet -- Enzyme Inhibition Constant Data from BindingDB
Found 2 hits for monomerid = 92266
TargetUDP-3-O-acyl-N-acetylglucosamine deacetylase(Pseudomonas aeruginosa)
D3R/Abbott
LigandPNGBDBM92266(CS256)
Affinity DataKd: >1.00E+5nM. Assay description: Thermofluor_Method1
In DepthDetails PubMed
LigandPNGBDBM92266(CS256)
Affinity DataKd: >1.00E+5nMpH: 7.0 T: 2°C. Assay description: Thermofluor
In DepthDetails PubMed