BDBM92284 CS278
SMILES CN(C)c1ccc(cc1)-c1nc(cs1)C(=O)NO
InChI Key InChIKey=VDVNSCOKSDCWDA-UHFFFAOYSA-N
Data  2 Kd
  Tab Delimited (TSV)   2D SDfile   Computed 3D by Vconf -m prep SDfile
Find this compound or compounds like it in BindingDB:
Activity Spreadsheet -- Enzyme Inhibition Constant Data from BindingDB
Found 2 hits for monomerid = 92284
TargetUDP-3-O-acyl-N-acetylglucosamine deacetylase(Pseudomonas aeruginosa)
D3R/Abbott
LigandPNGBDBM92284(CS278)
Affinity DataKd:  2.82E+4nM. Assay description: Thermofluor_Method1
Ligand InfoPC cidPC sid
In DepthDetails PubMed
LigandPNGBDBM92284(CS278)
Affinity DataKd:  2.82E+4nMpH: 7.0 T: 2°C. Assay description: Thermofluor
Ligand InfoPC cidPC sid
In DepthDetails PubMed