BDBM92330 Steroid, 10b
SMILES CC(=O)[C@]1(CCC2C3CC[C@@]45O[C@@H]4C(=O)CC[C@]5(C)C3CC[C@]12C)OC(=O)c1ccc(Br)cc1
InChI Key InChIKey=BOIZSPWBPGTACZ-UMTGVVQWSA-N
Data  1 IC50
  Tab Delimited (TSV)   2D SDfile   Computed 3D by Vconf -m prep SDfile
Find this compound or compounds like it in BindingDB:
Activity Spreadsheet -- Enzyme Inhibition Constant Data from BindingDB
Found 1 hit for monomerid = 92330
Target3-oxo-5-alpha-steroid 4-dehydrogenase 2(Homo sapiens (Human))
National University Of Mexico City
LigandPNGBDBM92330(Steroid, 10b)
Affinity DataIC50:  4.90nMpH: 6.5 T: 2°C. Assay description: The IC50 values for the synthesized steroids with human prostate 5alpha-reductase enzyme.
In DepthDetails ArticlePubMed