BDBM92334 Dipeptide nitrile, 7
SMILES CSCCC(NC(=O)[C@H](Cc1ccccc1)NC(=O)OC(C)(C)C)C#N
InChI Key InChIKey=GTLCQXONUOMHPR-LYKKTTPLSA-N
Data  4 KI
  Tab Delimited (TSV)   2D SDfile   Computed 3D by Vconf -m prep SDfile
Find this compound or compounds like it in BindingDB:
Activity Spreadsheet -- Enzyme Inhibition Constant Data from BindingDB
Found 4 hits for monomerid = 92334
TargetPapain(Carica papaya)
Rheinische Friedrich-Wilhelms-Universitat Bonn
LigandPNGBDBM92334(Dipeptide nitrile, 7)
Affinity DataKi:  250nM ΔG°:  -9.00kcal/molepH: 6.5 T: 2°C. Assay description: Papain enzyme activities were determined by spectrophotometric detection of the product p-nitroaniline at 25 C in a a multicell holder (parallel meas...
In DepthDetails ArticlePubMed
TargetProcathepsin L(Bos taurus (bovine))
Rheinische Friedrich-Wilhelms-Universitat Bonn
LigandPNGBDBM92334(Dipeptide nitrile, 7)
Affinity DataKi:  270nM ΔG°:  -9.32kcal/molepH: 6.0 T: 2°C. Assay description: Cathepsin enzyme activities were calculated from kinetic measurements performed by fluorimetric detection of the product 7-amino-4-methylcoumarin at ...
In DepthDetails ArticlePubMed
TargetCathepsin S(Homo sapiens (Human))
Rheinische Friedrich-Wilhelms-Universitat Bonn
LigandPNGBDBM92334(Dipeptide nitrile, 7)
Affinity DataKi:  650nM ΔG°:  -8.77kcal/molepH: 6.5 T: 2°C. Assay description: Cathepsin enzyme activities were calculated from kinetic measurements performed by fluorimetric detection of the product 7-amino-4-methylcoumarin at ...
In DepthDetails ArticlePubMed
TargetCathepsin K(Homo sapiens (Human))
Rheinische Friedrich-Wilhelms-Universitat Bonn
LigandPNGBDBM92334(Dipeptide nitrile, 7)
Affinity DataKi:  3.60E+3nM ΔG°:  -7.72kcal/molepH: 5.0 T: 2°C. Assay description: Cathepsin enzyme activities were calculated from kinetic measurements performed by fluorimetric detection of the product 7-amino-4-methylcoumarin at ...
In DepthDetails ArticlePubMed